source code published

3 jobs for master in 4 minutes and 28 seconds (queued for 1 second)
Status Job ID Name Coverage
  Build
failed #2696
assembleDebug

00:04:27

failed #2695
allowed to fail
lintDebug

00:04:09

 
  Test
skipped #2697
debugTests
 
Name Stage Failure
failed
assembleDebug Build

* Try:
Run with --stacktrace option to get the stack trace. Run with --info or --debug option to get more log output. Run with --scan to get full insights.

* Get more help at https://help.gradle.org

BUILD FAILED in 2m 14s
Cleaning up file based variables
ERROR: Job failed: command terminated with exit code 1
failed
lintDebug Build
> Task :app:generateDebugResValues
> Task :app:generateDebugResources
> Task :app:writeDebugApplicationId
> Task :app:processDebugGoogleServices FAILED
6 actionable tasks: 6 executed

BUILD FAILED in 2m 17s
Cleaning up file based variables
ERROR: Job failed: command terminated with exit code 1